{"text_format":"1","workbook":"xlsx","n_sheets":7,"sheets":["Instructions","Main Menu","Quarterly","Sheet1","Monthly","Quarterly with Monthly Wages","Lists"],"not_rendered":{"charts":0,"images":0,"macros":1,"external_links":0,"defined_names":0,"comments":0,"pivot_tables":0},"unopened":[],"bounds":{"document_bytes":16777216,"sheet_cells":100000,"rows_first":2000,"rows_last":500,"rows_between":2000,"halvings":0,"cell_chars":16384,"cell_head_chars":4096},"cells_cut":0,"cells_raw":0,"read":"whole","date_system":"1900"}

{"sheet":"Instructions","index":0,"n_rows":94,"n_cols":1,"rows_kept":94,"cut":false,"hidden":false,"merged":[[0,0,2,0]]}
["BAS Instructions"]
[]
[]
[]
["Step 1: Enter relevant information using the drop down menu set out on the \"Main Menu\""]
["The user must take a blank copy of the calculator before commencing a new assessment."]
["You will need the following information from the customer:"]
[" - Industry that business is in"]
[" - Type of BAS available (Simpler BAS, Full Reporting or GST Instalment Method)"]
[" - Frequency of BAS submissions (Quarterly, Monthly or Quarterly BAS with Monthly Wages*)"]
[" - The number of BAS available"]
[]
["*Please check the Integrated Client Account and / or Instalment Activity Statements to confirm if BAS submissions are quarterly and wages are reportedly monthly."]
[]
["Step 2: Once the relevant information is filled in, click \"Proceed\" to populate the relevant form to input your BAS details."]
["Note: If the customer is not eligible for the BAS Pathway, you will get a prompt and will be unable to proceed."]
[]
["If the populated form is \"Quarterly\", go to Step 3."]
["If the populated form is \"Monthly\", go to Step 4."]
["If the populated form is \"Quarterly with Monthly Wages\", go to Step 5."]
[]
["Step 3: Filling out the Quarterly BAS Calculator"]
["Enter the BAS values into the \"Quarterly\" form as per the matching BAS labels."]
[" - Total Sales (G1) - Confirm whether sales include GST or not by using the drop down menu \"Total Sales includes GST\" (Yes / No)"]
[" - GST on Sales (1A)"]
[" - GST on Purchases (1B)"]
[" - Total salary, wages and other payments (W1)"]
[" - Fringe Benefit Tax (FBT) (6A) - only if applicable, otherwise set it to zero"]
[]
["Additional Step (if you selected Full Reporting Method under Main Menu)"]
{"$rows_left_out":65}
{"sheet":"Main Menu","index":1,"n_rows":14,"n_cols":5,"rows_kept":14,"cut":false,"hidden":false,"merged":[[13,2,20,8],[2,4,8,8],[1,4,1,8],[7,1,7,2]]}
[]
[null,"SIMPLE+ BAS Calculator",null,null,"Before proceeding please review and confirm:"]
[null,null,null,null,"• 12 months most recent BAS are held\n• PAYG Instalments in the ATO Integrated Client Account (ICA) have been reviewed to verify if wages are paid monthly or quarterly. If monthly, an Instalment Activity Statement (IAS) has been obtained to verify monthly PAYG\n• Any director wages paid by the business do not exceed annual wages reported in the BAS. The quantum of director wages have been confirmed by an Accountant and are from a corresponding 12 month period to the BAS\n• Appropriate commentary has been input justifying any material variances or seasonality"]
[null,"Industry","All Other"]
[null,"BAS Submission Type","Simpler BAS"]
[null,"BAS Submission Frequency"]
[null,"Number of submission available"]
[null,"• Warning - Ensure PAYG Instalments in the ICA are not monthly"]
[]
[]
[]
[]
[null,null,"Banker Attestation:"]
[null,null,"I confirm that:\n\n• When 12 months most recent BAS and financial statements (utilised in a credit assessment within 12 months) are held, EBITDA from both periods have been input into the serviceability assessment to ensure a volatility test has been completed. \n\n• Where there is a >60% improvement in performance the volatility test will automatically fail and as a result sufficient commentary has been provided on why most recent BAS or an average of 2 years' financials is adopted."]

{"sheet":"Quarterly","index":2,"n_rows":61,"n_cols":8,"rows_kept":61,"cut":false,"hidden":true,"merged":[[42,0,52,7],[0,0,2,7]]}
[{"$f":"\"BAS CALCULATOR - QUARTERLY (\" &  Lists!$H$2 & \")\"","v":"BAS CALCULATOR - QUARTERLY (v1.5 - published 18/12/2024)"}]
[]
[]
[]
[null,null,1,2,3,4,"Total of Inputs","Annualised"]
[null,"Year"]
[null,"Month Ending"]
[]
[null,"BAS Item"]
["Total Sales","G1"]
[]
["Total Sales includes GST"]
[]
["GST on Sales","1A"]
[]
["Sales Net of GST",null,{"$f":"IF(AND(C10<>\"\",C12<>\"\",C14<>\"\"),IF(C12=\"Yes\",C10-C14,C10),\"\")","v":""},{"$f":"IF(AND(D10<>\"\",D12<>\"\",D14<>\"\"),IF(D12=\"Yes\",D10-D14,D10),\"\")","v":""},{"$f":"IF(AND(E10<>\"\",E12<>\"\",E14<>\"\"),IF(E12=\"Yes\",E10-E14,E10),\"\")","v":""},{"$f":"IF(AND(F10<>\"\",F12<>\"\",F14<>\"\"),IF(F12=\"Yes\",F10-F14,F10),\"\")","v":""},{"$f":"SUM(OFFSET($F16,0,0,1,-'Main Menu'!$C$7))","v":{"$error":"#REF!"}},{"$f":"G16*4/'Main Menu'!$C$7","v":{"$error":"#REF!"}}]
[]
["LESS"]
["Non Capital Purchases","G11"]
[]
["Capital Purchases","G10"]
[]
["GST on Purchases","1B"]
[]
["Purchases Net of GST",null,{"$f":"IF('Main Menu'!$C$5=\"Simpler BAS\",Quarterly!C$23*10,IF(C19<C23*11,C23*10,C19-C23))","v":0},{"$f":"IF('Main Menu'!$C$5=\"Simpler BAS\",Quarterly!D$23*10,IF(D19<D23*11,D23*10,D19-D23))","v":0},{"$f":"IF('Main Menu'!$C$5=\"Simpler BAS\",Quarterly!E$23*10,IF(E19<E23*11,E23*10,E19-E23))","v":0},{"$f":"IF('Main Menu'!$C$5=\"Simpler BAS\",Quarterly!F$23*10,IF(F19<F23*11,F23*10,F19-F23))","v":0},{"$f":"SUM(OFFSET($F25,0,0,1,-'Main Menu'!$C$7))","v":{"$error":"#REF!"}},{"$f":"G25*4/'Main Menu'!$C$7","v":{"$error":"#REF!"}}]
[]
["Total Salary, wages and other payments","W1",null,null,null,null,{"$f":"SUM(OFFSET($F27,0,0,1,-'Main Menu'!$C$7))","v":{"$error":"#REF!"}},{"$f":"G27*4/'Main Menu'!$C$7","v":{"$error":"#REF!"}}]
[]
["Staff OnCosts",null,{"$f":"0.15*C27","v":0},{"$f":"0.15*D27","v":0},{"$f":"0.15*E27","v":0},{"$f":"0.15*F27","v":0}]
[]
{"$rows_left_out":32}
{"sheet":"Sheet1","index":3,"n_rows":0,"n_cols":0,"rows_kept":0,"cut":false,"hidden":true,"merged":[]}

{"sheet":"Monthly","index":4,"n_rows":61,"n_cols":16,"rows_kept":61,"cut":false,"hidden":true,"merged":[[0,0,2,15],[42,0,52,15]]}
[{"$f":"\"BAS CALCULATOR - QUARTERLY (\" &  Lists!$H$2 & \")\"","v":"BAS CALCULATOR - QUARTERLY (v1.5 - published 18/12/2024)"}]
[]
[]
[]
[null,null,1,{"$f":"C5+1","v":2},{"$f":"D5+1","v":3},4,5,6,7,8,9,10,11,12,"Total of Inputs","Annualised"]
[null,"Year"]
[null,"Month"]
[]
[null,"BAS Item"]
["Total Sales","G1"]
[]
["Total Sales includes GST"]
[]
["GST on Sales","1A"]
[]
["Sales Net of GST",null,{"$f":"IF(AND(C10<>\"\",C12<>\"\",C14<>\"\"),IF(C12=\"Yes\",C10-C14,C10),\"\")","v":""},{"$f":"IF(AND(D10<>\"\",D12<>\"\",D14<>\"\"),IF(D12=\"Yes\",D10-D14,D10),\"\")","v":""},{"$f":"IF(AND(E10<>\"\",E12<>\"\",E14<>\"\"),IF(E12=\"Yes\",E10-E14,E10),\"\")","v":""},{"$f":"IF(AND(F10<>\"\",F12<>\"\",F14<>\"\"),IF(F12=\"Yes\",F10-F14,F10),\"\")","v":""},{"$f":"IF(AND(G10<>\"\",G12<>\"\",G14<>\"\"),IF(G12=\"Yes\",G10-G14,G10),\"\")","v":""},"","","","","","","",{"$f":"SUM(OFFSET($N16,0,0,1,-'Main Menu'!$C$7))","v":{"$error":"#REF!"}},{"$f":"O16*12/'Main Menu'!$C$7","v":{"$error":"#REF!"}}]
[]
["LESS"]
["Non Capital Purchases","G11"]
[]
["Capital Purchases","G10"]
[]
["GST on Purchases","1B"]
[]
["Purchases Net of GST",null,{"$f":"IF('Main Menu'!$C$5=\"Simpler BAS\",Monthly!C$23*10,IF(C19<C23*11,C23*10,C19-C23))","v":0},{"$f":"IF('Main Menu'!$C$5=\"Simpler BAS\",Monthly!D$23*10,IF(D19<D23*11,D23*10,D19-D23))","v":0},{"$f":"IF('Main Menu'!$C$5=\"Simpler BAS\",Monthly!E$23*10,IF(E19<E23*11,E23*10,E19-E23))","v":0},{"$f":"IF('Main Menu'!$C$5=\"Simpler BAS\",Monthly!F$23*10,IF(F19<F23*11,F23*10,F19-F23))","v":0},{"$f":"IF('Main Menu'!$C$5=\"Simpler BAS\",Monthly!G$23*10,IF(G19<G23*11,G23*10,G19-G23))","v":0},{"$f":"IF('Main Menu'!$C$5=\"Simpler BAS\",Monthly!H$23*10,IF(H19<H23*11,H23*10,H19-H23))","v":0},{"$f":"IF('Main Menu'!$C$5=\"Simpler BAS\",Monthly!I$23*10,IF(I19<I23*11,I23*10,I19-I23))","v":0},{"$f":"IF('Main Menu'!$C$5=\"Simpler BAS\",Monthly!J$23*10,IF(J19<J23*11,J23*10,J19-J23))","v":0},{"$f":"IF('Main Menu'!$C$5=\"Simpler BAS\",Monthly!K$23*10,IF(K19<K23*11,K23*10,K19-K23))","v":0},{"$f":"IF('Main Menu'!$C$5=\"Simpler BAS\",Monthly!L$23*10,IF(L19<L23*11,L23*10,L19-L23))","v":0},{"$f":"IF('Main Menu'!$C$5=\"Simpler BAS\",Monthly!M$23*10,IF(M19<M23*11,M23*10,M19-M23))","v":0},{"$f":"IF('Main Menu'!$C$5=\"Simpler BAS\",Monthly!N$23*10,IF(N19<N23*11,N23*10,N19-N23))","v":0},{"$f":"SUM(OFFSET($N25,0,0,1,-'Main Menu'!$C$7))","v":{"$error":"#REF!"}},{"$f":"O25*12/'Main Menu'!$C$7","v":{"$error":"#REF!"}}]
[]
["Total Salary, wages and other payments","W1",null,null,null,null,null,null,null,null,null,null,null,null,{"$f":"SUM(OFFSET($N27,0,0,1,-'Main Menu'!$C$7))","v":{"$error":"#REF!"}},{"$f":"O27*12/'Main Menu'!$C$7","v":{"$error":"#REF!"}}]
[]
["Staff OnCosts",null,{"$f":"0.15*C27","v":0},{"$f":"0.15*D27","v":0},{"$f":"0.15*E27","v":0},{"$f":"0.15*F27","v":0},{"$f":"0.15*G27","v":0},0,0,0,0,0,0,0]
[]
{"$rows_left_out":32}
{"sheet":"Quarterly with Monthly Wages","index":5,"n_rows":70,"n_cols":8,"rows_kept":70,"cut":false,"hidden":true,"merged":[[0,0,2,7],[46,0,62,7]]}
[{"$f":"\"BAS CALCULATOR- QUARTERLY WITH MONTHLY WAGES (\" &  Lists!$H$2 & \")\"","v":"BAS CALCULATOR- QUARTERLY WITH MONTHLY WAGES (v1.5 - published 18/12/2024)"}]
[]
[]
[]
[null,null,1,2,3,4,"Total","Annualised"]
[null,"Year"]
[null,"Month Ending"]
[]
[null,"BAS Item"]
["Total Sales","G1"]
[]
["Total Sales includes GST"]
[]
["GST on Sales","1A"]
[]
["Sales Net of GST",null,{"$f":"IF(AND(C10<>\"\",C12<>\"\",C14<>\"\"),IF(C12=\"Yes\",C10-C14,C10),\"\")","v":""},{"$f":"IF(AND(D10<>\"\",D12<>\"\",D14<>\"\"),IF(D12=\"Yes\",D10-D14,D10),\"\")","v":""},"","",{"$f":"SUM(OFFSET($F16,0,0,1,-'Main Menu'!$C$7))","v":{"$error":"#REF!"}},{"$f":"$G16*4/'Main Menu'!$C$7","v":{"$error":"#REF!"}}]
[]
["LESS"]
["Non Capital Purchases","G11"]
[]
["Capital Purchases","G10"]
[]
["GST on Purchases","1B"]
[]
["Purchases Net of GST",null,{"$f":"IF('Main Menu'!$C$5=\"Simpler BAS\",'Quarterly with Monthly Wages'!C$23*10,IF(C19<C23*11,C23*10,C19-C23))","v":0},{"$f":"IF('Main Menu'!$C$5=\"Simpler BAS\",'Quarterly with Monthly Wages'!D$23*10,IF(D19<D23*11,D23*10,D19-D23))","v":0},{"$f":"IF('Main Menu'!$C$5=\"Simpler BAS\",'Quarterly with Monthly Wages'!E$23*10,IF(E19<E23*11,E23*10,E19-E23))","v":0},{"$f":"IF('Main Menu'!$C$5=\"Simpler BAS\",'Quarterly with Monthly Wages'!F$23*10,IF(F19<F23*11,F23*10,F19-F23))","v":0},{"$f":"SUM(OFFSET($F25,0,0,1,-'Main Menu'!$C$7))","v":{"$error":"#REF!"}},{"$f":"$G25*4/'Main Menu'!$C$7","v":{"$error":"#REF!"}}]
[]
["Total Salary, wages and other payments","W1-Month 1",null,null,null,null,{"$f":"SUM(OFFSET($F27,0,0,1,-'Main Menu'!$C$7))","v":{"$error":"#REF!"}},{"$f":"$G27*4/'Main Menu'!$C$7","v":{"$error":"#REF!"}}]
[]
[null,"W1-Month 2",null,null,null,null,{"$f":"SUM(OFFSET($F29,0,0,1,-'Main Menu'!$C$7))","v":{"$error":"#REF!"}},{"$f":"$G29*4/'Main Menu'!$C$7","v":{"$error":"#REF!"}}]
[]
{"$rows_left_out":41}
{"sheet":"Lists","index":6,"n_rows":13,"n_cols":8,"rows_kept":13,"cut":false,"hidden":true,"merged":[]}
["Industry","Frequency","Quarterly","Yearly","Type of BAS","Year","Month","Version"]
["Agriculture","Quarterly",1,1,"Simpler BAS",2023,"January","v1.5 - published 18/12/2024"]
["Aged care and nursing homes","Monthly",2,2,"Full Form BAS",2024,"February"]
["Childcare","Quarterly with Monthly Wages",3,3,"GST Instalment Method",2025,"March"]
["Food Wholesale & Retailer ",null,4,4,null,2026,"April"]
["Hospitals & Pharmacies",null,null,5,null,2027,"May"]
["Property Developers",null,null,6,null,null,"June"]
["Religious Organisations",null,null,7,null,null,"July"]
["Franchises",null,null,8,null,null,"August"]
["Not-for-profit",null,null,9,null,null,"September"]
["Travel Agents",null,null,10,null,null,"October"]
["All Other",null,null,11,null,null,"November"]
[null,null,null,12,null,null,"December"]