{"text_format":"1","workbook":"xlsx","n_sheets":3,"sheets":["Translation Checklist","Version Control","Data"],"not_rendered":{"charts":0,"images":3,"macros":1,"external_links":0,"defined_names":4,"comments":0,"pivot_tables":0},"unopened":[],"bounds":{"document_bytes":16777216,"sheet_cells":100000,"rows_first":2000,"rows_last":500,"rows_between":2000,"halvings":0,"cell_chars":16384,"cell_head_chars":4096},"cells_cut":0,"cells_raw":0,"read":"whole","date_system":"1900"}

{"sheet":"Translation Checklist","index":0,"n_rows":220,"n_cols":27,"rows_kept":220,"cut":false,"hidden":false,"merged":[[149,0,149,27],[151,0,153,1],[151,6,151,12],[155,18,155,25],[157,0,163,2],[157,4,158,16],[157,19,157,23],[159,4,159,16],[159,19,159,23],[159,25,159,26],[160,4,160,16],[161,4,161,16],[161,19,161,23],[213,18,213,25],[218,4,218,16],[219,4,219,16],[215,0,221,2],[215,4,216,16],[215,19,215,23],[217,4,217,16],[217,19,217,23],[217,25,217,26],[219,19,219,23],[201,4,201,16],[201,19,201,23],[201,25,201,26],[202,4,202,16],[203,4,203,16],[203,19,203,23],[206,0,206,27],[208,0,210,1],[208,6,208,12],[190,4,190,16],[191,4,191,16],[191,19,191,23],[193,0,199,2],[193,4,194,16],[193,19,193,23],[195,4,195,16],[195,19,195,23],[195,25,195,26],[196,4,196,16],[197,4,197,16],[197,19,197,23],[199,4,200,16],[199,19,199,23],[187,4,188,16],[187,19,187,23],[189,4,189,16],[189,19,189,23],[189,25,189,26],[171,0,171,27],[173,0,175,1],[173,6,173,12],[178,18,178,25],[181,0,187,2],[181,4,182,16],[181,19,181,23],[183,4,183,16],[183,19,183,23],[183,25,183,26],[184,4,184,16],[185,4,185,16],[185,19,185,23],[136,18,136,25],[112,18,112,25],[81,18,81,25],[104,19,104,23],[119,19,119,23],[88,19,88,23],[16,16,16,22],[19,16,19,22],[123,25,123,26],[16,24,16,25],[104,4,104,16],[27,1,27,27],[45,25,45,26],[67,25,67,26],[43,4,43,5],[45,0,51,2],[80,0,82,1],[57,0,58,1],[61,0,64,1],[63,19,63,23],[44,19,44,23],[16,1,16,14],[99,0,105,2],[45,19,45,23],[141,25,141,26],[139,19,139,23],[141,19,141,23],[125,24,126,27],[143,19,143,23],[95,0,97,1],[115,0,117,1],[111,0,113,1],[139,0,145,2],[139,4,140,16],[141,4,141,16],[142,4,142,16],[143,4,143,16],[129,0,129,27],[131,0,133,1],[131,6,131,12],[121,19,121,23],[121,4,122,16],[123,19,123,23],[125,19,125,23],[119,0,125,2],[123,4,123,16],[124,4,124,16],[125,4,125,16],[47,19,47,23],[39,0,42,1],[41,19,41,23],[41,4,42,17],[119,4,120,16],[114,4,114,27],[115,4,115,27],[116,4,116,27],[103,4,103,16],[102,4,102,16],[109,0,109,27],[86,25,86,26],[102,25,102,26],[100,4,101,16],[100,19,100,23],[102,19,102,23],[84,0,90,2],[19,1,19,14],[22,1,22,14],[22,16,22,22],[35,0,36,1],[33,0,33,27],[38,6,38,25],[36,6,36,25],[35,6,35,25],[25,1,25,27],[24,1,24,27],[26,1,26,27],[22,24,22,26],[1,23,1,25],[4,11,4,14],[9,1,9,27],[13,1,13,27],[14,1,14,27],[7,23,7,27],[67,0,74,2],[88,24,89,25],[86,19,86,23],[84,4,85,16],[55,0,55,27],[80,6,80,25],[84,19,84,23],[66,19,66,23],[69,19,69,23],[67,19,67,23],[65,4,65,5],[72,4,75,27],[63,4,64,17],[57,6,57,25],[58,6,58,25],[60,6,60,25],[50,19,50,23],[52,19,52,23]]}
[]
[null,null,null,null,null,null,null,null,null,null,null,null,null,null,null,null,null,null,null,null,null,null,null,"Translation Checklist"]
["A Division of Westpac Banking Corporation ABN 33 007 457 141 ASFL and Australian credit licence 233714"]
[]
["File details","clas ref",null,null,null,null,null,null,null,null,null,"Atoms ref"]
[]
[null,"Loan account number",null,null,null,null,null,null,null,null,null,null,null,null,null,null,null,null,null,null,null,null,null,"Document language"]
[]
[null,"Applicants name"]
[]
[]
[]
["Your details","I certify:"]
[null,"1. I have supplied an English translation prepared by an accredited NAATI translator."]
[null,"2. Foreign income documents provided have been summarised in sections 1 to 5 below and are in terms of St George Bank Group income policy."]
[null,"Lender / Originator name",null,null,null,null,null,null,null,null,null,null,null,null,null,null,"Contact number",null,null,null,null,null,null,null,"Employee / Broker number"]
[]
[]
[null,"Signature",null,null,null,null,null,null,null,null,null,null,null,null,null,null,"Date"]
[null,"✗"]
[]
[null,"Branch name",null,null,null,null,null,null,null,null,null,null,null,null,null,null,"State",null,null,null,null,null,null,null,"Branch number"]
[null,null,null,null,null,null,null,null,null,null,null,null,null,null,null,null,"please select"]
[]
["Notes: ","1. The Translation Checklist is certified by the person who completes the currency conversion. If the currency conversion is "]
[null,"completed by a finance broker, Bank staff must check the rate used and calculation."]
[null,"2. In all cases this document,  the original and translated documents, as well as the printout or screen dump showing "]
[null,"the exchange rate are to be retained with the application"]
[null,"3. Acceptable currencies are only those listed in CLLP Verifying Income 2.5.4 Acceptable country / currency list"]
[null,"4. This document does not capture all policy requirements, in each case refer to the relevant section of the "]
[null,"Consumer Lending - Lending Policy",null,null,null,null,null,null,null,null,null,"(including: Migrant Lending, Verifying Income, Commitments and Living Expenses)"]
[]
[]
["Australian Citizens or approved Permanent visa holders,  applicants ordinarily resident in Australia - PAYG Income (use base income only) "]
[]
["Tick ( ) documents provided\n\nNote: must be in terms of CLLP Verifying Income",null,null,null,null,null,"Last 2 payslips detailing base salary = use gross base salary only or"]
[null,null,null,null,null,null,"YTD pay slip detailing base salary, covering last 2 pay cycles = use gross base salary only"]
[null,null,null,null,"And in all cases"]
[null,null,null,null,null,null,"The most recent personal Australian tax return and Australian Taxation office, Notice of Assessment"]
["Note: If two salary credits differ the lower amount is to be used to annualise income"]
[null,null,null,null,"Step 1"]
[null,null,null,null,"Gross base Foreign amount and payment frequency  ie weekly / fortnightly / monthly",null,null,null,null,null,null,null,null,null,null,null,null,null,"$",null,null,null,null,null,"Frequency","please select",{"$f":"VLOOKUP(Z42,Data!$F$2:$G$5,2,)","v":0}]
[]
[null,null,null,null,"OR"]
[null,null,null,null,"YTD Payslip (covering last 2 pay cycles)",null,null,null,null,null,null,null,null,null,null,null,null,null,"$"]
["Exchange rate\n* Use \"Foreign exchange calculator\" via https://webapps.stgeorge.com.\nau/rates-net/fx-calculator.aspx\n*If no rate available from St.George\n site use http://xe.com\n* Attach print out or screen dump of exchange rate and calculation\n",null,null,null,"Exchange rate",null,null,null,null,null,null,null,null,null,null,null,null,null,null,null,null,null,null,null,"Currency","please select"]
[null,null,null,null,"Date of currency conversion",null,null,null,null,null,null,null,null,null,null,null,null,null,null,null,"/",null,"/"]
[null,null,null,null,"AUD equivalent (annualised)",null,null,null,null,null,null,null,null,null,null,null,null,null,"$",{"$f":"IFERROR(IF(AND(OR(T42<>0,T42<>\"\"),OR(T45<>0,T45<>\"\")),\"Check Input\",IF(OR(T42<>0,T42<>\"\"),(T42*AA42)/T46,IF(OR(T45<>0,T45<>\"\"),T45/T46,\"\"))),\"Check Input\")","v":""}]
[null,null,null,null,"and in all cases"]
[null,null,null,null,"Step 2"]
[null,null,null,null,"Australian Tax return & ATO NOA",null,null,null,null,null,null,null,null,null,null,null,null,null,"$",null,null,null,null,null,"Currency","AUD"]
[]
[null,null,null,null,"Lower of income Step 1 or Step 2",null,null,null,null,null,null,null,null,null,null,null,null,null,"$",{"$f":"IF(T48=\"\",\"\",MIN(T48,T51))","v":""},null,null,null,null,"Load clas with AUD Gross as taxable income"]
[]
[]
["Australian Citizens or approved Permanent visa holders,  applicants ordinarily resident outside of Australia - PAYG Income (use base income only) "]
[]
["Tick ( ) documents provided\n\nNote: must be in terms of CLLP Verifying Income",null,null,null,null,null,"Last 2 payslips detailing base salary = use gross base salary only or"]
[null,null,null,null,null,null,"YTD pay slip detailing base salary, covering last 2 pay cycles = use gross base salary only"]
[null,null,null,null,"And in all cases"]
[null,null,null,null,null,null,"minimum 3 months consistent salary credits to a bank account"]
["Note: If two salary credits differ the lower amount is to be used to annualise income"]
[null,null,null,null,"Step 1"]
[null,null,null,null,"Gross base Foreign amount and payment frequency  ie weekly / fortnightly / monthly",null,null,null,null,null,null,null,null,null,null,null,null,null,"$",null,null,null,null,null,"Frequency","please select",{"$f":"VLOOKUP(Z64,Data!$F$2:$G$5,2,)","v":0}]
[]
[null,null,null,null,"OR"]
[null,null,null,null,"YTD Payslip (covering last 2 pay cycles)",null,null,null,null,null,null,null,null,null,null,null,null,null,"$"]
["Exchange rate\n* Use \"Foreign exchange calculator\" via https://webapps.stgeorge.com.\nau/rates-net/fx-calculator.aspx\n*If no rate available from St.George \nsite use http://xe.com\n* Attach print out or screen dump of exchange rate and calculation\n",null,null,null,"Exchange rate",null,null,null,null,null,null,null,null,null,null,null,null,null,null,null,null,null,null,null,"Currency","please select"]
[null,null,null,null,"Date of currency conversion",null,null,null,null,null,null,null,null,null,null,null,null,null,null,null,"/",null,"/"]
[null,null,null,null,"AUD equivalent (annualised)",null,null,null,null,null,null,null,null,null,null,null,null,null,"$",{"$f":"IFERROR(IF(AND(OR(T64<>0,T64<>\"\"),OR(T67<>0,T67<>\"\")),\"Check Input\",IF(OR(T64<>0,T64<>\"\"),(T64*AA64)/T68,IF(OR(T67<>0,T67<>\"\"),T67/T68,\"\"))),\"Check Input\")","v":""},null,null,null,null,"Load clas with AUD Gross as taxable income"]
[null,null,null,null,"and in all cases"]
[null,null,null,null,"Step 2"]
[null,null,null,null,"Confirm that the net income from the payslip and the payment date are consistent with the deposits on the bank account statements. If the income amount varies between payslips or credit to account (eg there is no consistency of income), the lowest value on either the payslips or credits to account are to be accepted (use step 1 field)"]
[]
[]
[]
[]
[]
[" Rental Income"]
[]
["Tick ( ) documents provided\n\nNote: must be in terms of CLLP Verifying Income",null,null,null,null,null,"Minimum 6 months bank account statements "]
[null,null,null,null,null,null,"other documents (please specify)"]
[]
[]
["Exchange rate\n* Use \"Foreign exchange calculator\" via https://webapps.stgeorge.com.\nau/rates-net/fx-calculator.aspx\n*If no rate available from St.George \nsite use http://xe.com\n* Attach print out or screen dump of exchange rate and calculation\n",null,null,null,"Gross Foreign amount and payment frequency",null,null,null,null,null,null,null,null,null,null,null,null,null,"$",null,null,null,null,null,"Frequency","please select",{"$f":"VLOOKUP(Z85,Data!$F$2:$G$5,2,)","v":0}]
[]
[null,null,null,null,"Exchange rate",null,null,null,null,null,null,null,null,null,null,null,null,null,null,null,null,null,null,null,"Currency","please select"]
[null,null,null,null,"Date of currency conversion",null,null,null,null,null,null,null,null,null,null,null,null,null,null,null,"/",null,"/"]
[null,null,null,null,"AUD equivalent",null,null,null,null,null,null,null,null,null,null,null,null,null,"$",{"$f":"IFERROR(T85/T87,\"\")","v":""},null,null,null,null,"Load rental against the related property icon in clas "]
[]
[null,null,null,null,"* if two rental credits differ the lower amount is to be used for conversion"]
[]
[]
["Pension Income"]
[]
["Tick ( ) documents provided\n\nNote: must be in terms of CLLP Verifying Income",null,null,null,null,null,"letter from the relevant government department confirming the benefit and payment frequency "]
[null,null,null,null,"and"]
[null,null,null,null,null,null,"a minimum of 3 months consistent pension credits into a bank account"]
[]
["Exchange rate\n* Use \"Foreign exchange calculator\" via https://webapps.stgeorge.com.\nau/rates-net/fx-calculator.aspx\n*If no rate available from St.George \nsite use http://xe.com\n* Attach print out or screen dump of exchange rate and calculation\n"]
[null,null,null,null,"Gross Foreign amount and payment frequency",null,null,null,null,null,null,null,null,null,null,null,null,null,"$",null,null,null,null,null,"Frequency","please select",{"$f":"VLOOKUP(Z101,Data!$F$2:$G$5,2,)","v":0}]
[]
[null,null,null,null,"Exchange rate",null,null,null,null,null,null,null,null,null,null,null,null,null,null,null,null,null,null,null,"Currency","please select"]
[null,null,null,null,"Date of currency conversion",null,null,null,null,null,null,null,null,null,null,null,null,null,null,null,"/",null,"/"]
[null,null,null,null,"AUD equivalent",null,null,null,null,null,null,null,null,null,null,null,null,null,"$",{"$f":"IFERROR(T101/T103,\"\")","v":""}]
[]
[]
[]
[]
["Funds to complete / own contribution validation \n(where directed to complete in CLLP Migrant Lending 2.1.3 - Visa matrix and Applicant via Resident Type matrix)"]
[]
["Tick ( ) documents provided\n\nNote: must be in terms of CLLP Verifying Income",null,null,null,null,null,"Bank statements in applicants's name"]
[null,null,null,null,null,null,"other documents (please specify)"]
[]
[null,null,null,null,"Note: if the bank statements provided are not in the name of the applicant(s), lenders are to establish "]
["Funds to complete / own contribution includes deposit, stamp duty, legal costs etc",null,null,null,"who is the account holder and their relationship to the applicant.  The file will require referral to Credit for "]
[null,null,null,null,"consideration"]
[]
[]
["Exchange rate\n* Use \"Foreign exchange calculator\" via https://webapps.stgeorge.com.\nau/rates-net/fx-calculator.aspx\n*If no rate available from St.George \nsite use http://xe.com\n* Attach print out or screen dump of exchange rate and calculation\n",null,null,null,"Funds to complete or own contribution required (as indicated in clas funds tab)",null,null,null,null,null,null,null,null,null,null,null,null,null,"$",null,null,null,null,null,"#"]
[null,null,null,null,null,null,null,null,null,null,null,null,null,null,null,null,null,null,null,null,null,null,null,null,null," "]
[null,null,null,null,"Gross Foreign amount held in bank account",null,null,null,null,null,null,null,null,null,null,null,null,null,"$"]
[]
[null,null,null,null,"Exchange rate",null,null,null,null,null,null,null,null,null,null,null,null,null,null,null,null,null,null,null,"Currency","please select"]
[null,null,null,null,"Date of currency conversion",null,null,null,null,null,null,null,null,null,null,null,null,null,null,null,"/",null,"/"]
[null,null,null,null,"AUD equivalent",null,null,null,null,null,null,null,null,null,null,null,null,null,"$",{"$f":"IFERROR(T122/T124,\"\")","v":""},null,null,null,null,"AUD equivalent must be equal or greater than the funds to complete figure above#"]
[]
[]
[]
["Self Employed \n(effective 26/4/2016 this income type is unacceptable and you must have Credit approval to use the income as an exception to Bank policy)"]
[]
["Tick ( ) documents provided\n\nNote: must be in terms of CLLP Verifying Income",null,null,null,null,null,"Last two years:"]
[null,null,null,null,null,null,"Personal tax returns for all applicants and"]
[null,null,null,null,null,null,"Partnership tax returns and"]
[null,null,null,null,null,null,"Trust or company tax returns and Financial Statements"]
[null,null,null,null,null,null,"(including Profit and Loss accounts and Balance Sheets)"]
[null,null,null,null,null,null,"other documents (please specify)"]
[]
[]
["Exchange rate\n* Use \"Foreign exchange calculator\" via https://webapps.stgeorge.com.\nau/rates-net/fx-calculator.aspx\n*If no rate available from St.George \nsite use http://xe.com\n* Attach print out or screen dump of exchange rate and calculation\n",null,null,null,"Gross foreign amount",null,null,null,null,null,null,null,null,null,null,null,null,null,"$"]
[]
[null,null,null,null,"Exchange rate",null,null,null,null,null,null,null,null,null,null,null,null,null,null,null,null,null,null,null,"Currency","please select"]
[null,null,null,null,"Date of currency conversion",null,null,null,null,null,null,null,null,null,null,null,null,null,null,null,"/",null,"/"]
[null,null,null,null,"AUD equivalent",null,null,null,null,null,null,null,null,null,null,null,null,null,"$",{"$f":"IFERROR(T140/T142,\"\")","v":""}]
[]
[]
[]
[]
[]
["Commitments - Foreign Monthly Child Support"]
[]
["Tick ( ) documents provided\n\nNote: must be in terms of CLLP Commitments"]
[null,null,null,null,null,null,"A copy of the court order or child support agency letter"]
[null,null,null,null,null,null,"Bank statement or transaction listing"]
[null,null,null,null,null,null,"Two consecutive payslips"]
[null,null,null,null,null,null,"other documents (please specify)"]
[]
["Exchange rate\n* Use \"Foreign exchange calculator\" via https://webapps.stgeorge.com.\nau/rates-net/fx-calculator.aspx\n*If no rate available from St.George \nsite use http://xe.com\n* Attach print out or screen dump of exchange rate and calculation\n",null,null,null,"Gross foreign amount",null,null,null,null,null,null,null,null,null,null,null,null,null,"$"]
[]
[null,null,null,null,"Exchange rate",null,null,null,null,null,null,null,null,null,null,null,null,null,null,null,null,null,null,null,"Currency","please select"]
[null,null,null,null,"Date of currency conversion",null,null,null,null,null,null,null,null,null,null,null,null,null,null,null,"/",null,"/"]
[null,null,null,null,"AUD equivalent",null,null,null,null,null,null,null,null,null,null,null,null,null,"$",{"$f":"IFERROR(T158/T160,\"\")","v":""}]
[]
[]
[]
[]
[]
[]
[]
[]
[]
["Commitments - Foreign Liabilities\n(use greater of limit or balance)"]
[]
["Tick ( ) documents provided\n\nNote: must be in terms of CLLP Commitments"]
[null,null,null,null,null,null,"Statement"]
[null,null,null,null,null,null,"Transaction Listing"]
[null,null,null,null,null,null,"Account summary printout"]
[null,null,null,null,null,null,"Stamped & dated document from other financial institution evidencing account details"]
[null,null,null,null,null,null,"other documents (please specify)"]
[]
[]
["Exchange rate\n* Use \"Foreign exchange calculator\" via https://webapps.stgeorge.com.\nau/rates-net/fx-calculator.aspx\n*If no rate available from St.George \nsite use http://xe.com\n* Attach print out or screen dump of exchange rate and calculation\n",null,null,null,"Foreign Limit/Balance (greater of)",null,null,null,null,null,null,null,null,null,null,null,null,null,"$"]
[]
[null,null,null,null,"Exchange rate",null,null,null,null,null,null,null,null,null,null,null,null,null,null,null,null,null,null,null,"Currency","please select"]
[null,null,null,null,"Date of currency conversion",null,null,null,null,null,null,null,null,null,null,null,null,null,null,null,"/",null,"/"]
[null,null,null,null,"AUD equivalent",null,null,null,null,null,null,null,null,null,null,null,null,null,"$",{"$f":"IFERROR(T182/T184,\"\")","v":""}]
[]
[null,null,null,null,"Foreign limit/balance (greater of)",null,null,null,null,null,null,null,null,null,null,null,null,null,"$"]
[]
[null,null,null,null,"Exchange rate",null,null,null,null,null,null,null,null,null,null,null,null,null,null,null,null,null,null,null,"Currency","please select"]
[null,null,null,null,"Date of currency conversion",null,null,null,null,null,null,null,null,null,null,null,null,null,null,null,"/",null,"/"]
[null,null,null,null,"AUD equivalent",null,null,null,null,null,null,null,null,null,null,null,null,null,"$",{"$f":"IFERROR(T188/T190,\"\")","v":""}]
[]
[null,null,null,null,"Foreign Limit/Balance (greater of)",null,null,null,null,null,null,null,null,null,null,null,null,null,"$"]
[]
[null,null,null,null,"Exchange rate",null,null,null,null,null,null,null,null,null,null,null,null,null,null,null,null,null,null,null,"Currency","please select"]
[null,null,null,null,"Date of currency conversion",null,null,null,null,null,null,null,null,null,null,null,null,null,null,null,"/",null,"/"]
[null,null,null,null,"AUD equivalent",null,null,null,null,null,null,null,null,null,null,null,null,null,"$",{"$f":"IFERROR(T194/T196,\"\")","v":""}]
[]
[null,null,null,null,"Foreign Limit/Balance (greater of)",null,null,null,null,null,null,null,null,null,null,null,null,null,"$"]
[]
[null,null,null,null,"Exchange rate",null,null,null,null,null,null,null,null,null,null,null,null,null,null,null,null,null,null,null,"Currency","please select"]
[null,null,null,null,"Date of currency conversion",null,null,null,null,null,null,null,null,null,null,null,null,null,null,null,"/",null,"/"]
[null,null,null,null,"AUD equivalent",null,null,null,null,null,null,null,null,null,null,null,null,null,"$",{"$f":"IFERROR(T200/T202,\"\")","v":""}]
[]
[]
["Commitments - Foreign Monthly Rental Outgo"]
[]
["Tick ( ) documents provided\n\nNote: must be in terms of CLLP Commitments"]
[null,null,null,null,null,null,"Current signed and dated lease/rental agreement"]
[null,null,null,null,null,null,"Letter from licensed property manager/agent"]
[null,null,null,null,null,null,"Rental ledger from licensed property manager/agent"]
[null,null,null,null,null,null,"Bank statement or transaction listing"]
[null,null,null,null,null,null,"other documents (please specify)"]
[]
["Exchange rate\n* Use \"Foreign exchange calculator\" via https://webapps.stgeorge.com.\nau/rates-net/fx-calculator.aspx\n*If no rate available from St.George \nsite use http://xe.com\n* Attach print out or screen dump of exchange rate and calculation\n",null,null,null,"Gross foreign amount",null,null,null,null,null,null,null,null,null,null,null,null,null,"$"]
[]
[null,null,null,null,"Exchange rate",null,null,null,null,null,null,null,null,null,null,null,null,null,null,null,null,null,null,null,"Currency","please select"]
[null,null,null,null,"Date of currency conversion",null,null,null,null,null,null,null,null,null,null,null,null,null,null,null,"/",null,"/"]
[null,null,null,null,"AUD equivalent",null,null,null,null,null,null,null,null,null,null,null,null,null,"$",{"$f":"IFERROR(T216/T218,\"\")","v":""}]

{"sheet":"Version Control","index":1,"n_rows":8,"n_cols":5,"rows_kept":8,"cut":false,"hidden":false,"merged":[[2,0,2,4]]}
["Business Owner: ","Retail Credit Risk","Dianne Wilk"]
[]
["Change history"]
["Amendment number","Amendment issue date","Description of changes","Version Number","Amended by"]
[1,"2015-05-15","First version created ",3,"f167347"]
[2,"2016-05-15",". Code and Insert form controls - print, Clear, Admin\n. Edit Formulas to reflect correct time (Annualise when required, covert to Australian\n. Edit lock feature so that locked cells cannot be selected",3.1,"M025250"]
[3,"2016-10-03","Add to footer Name of document and effective date and version number\nWithin notes section of page 1 of the document, currently referred to incorrect sections of the consumer lending manual.  Updated reference to 9.8 Acceptable countries to 6.9.9 and Foreign Income (within CLM 6.4.7) to (within CLM 6.9) ",4,"f167347"]
[4,"2019-04-27","Additional sections added in line with Commitments policy:\n. Commitments - Foreign Liabilities\n. Commitments - Foreign Monthly Rental Outgo\n. Commitments - Foreign Monthly Child Support\nReferences and links updated to Consumer Lending - Lending Policy",5,"M432259"]

{"sheet":"Data","index":2,"n_rows":40,"n_cols":7,"rows_kept":40,"cut":false,"hidden":true,"merged":[[0,5,0,6]]}
[null,null,null,"COUNTRY","STATE","FREQUENCY"]
[null,null,null,"please select","please select","please select",0]
[null,null,null,"AED - Emirati Dirham","ACT","Weekly",52]
[null,null,null,"BHD - Bahrani Dinar","NSW","Fortnightly",26]
[null,null,null,"BND - Bruneian dollar","NT","Monthly",12]
[null,null,null,"CAD - Canadian dollar","QLD"]
[null,null,null,"CHF - Swiss Franc","SA"]
[null,null,null,"CNY-Chinese Yaun Renminbi","TAS"]
[null,null,null,"DKK - Danish Krone","VIC"]
[null,null,null,"EUR - Euro","WA"]
[null,null,null,"FJD - Fijian dollar"]
[null,null,null,"GPB - Great British Pound"]
[null,null,null,"HKD - Hong Kong dollar"]
[null,null,null,"IDR - Indonesian Rupiah"]
[null,null,null,"INR - Indian Rupee"]
[null,null,null,"JPY - Japanese Yen"]
[null,null,null,"KRW - South Korean Won"]
[null,null,null,"KWD - Kuwait Dinar"]
[null,null,null,"LKR - Sri Lankan Rupee"]
[null,null,null,"MOP - Macau Pataca"]
[null,null,null,"MUR - Mauritian Rupee"]
[null,null,null,"MYR - Malaysian Ringgit"]
[null,null,null,"NOK - Norweigian Krone"]
[null,null,null,"NZD - New Zealand dollar"]
[null,null,null,"OMR - Omani Rial"]
[null,null,null,"PGK - Papau New Ginean Kina"]
[null,null,null,"PHP - Philippine Peso"]
[null,null,null,"QAR - Qatar Riyal"]
[null,null,null,"SAR - South African Rand"]
[null,null,null,"SAR - Saudi Arabian Riyal"]
[null,null,null,"SBD - Solomon Island dollar"]
[null,null,null,"SEK - Swedish Krona"]
[null,null,null,"SGD - Singapore dollar"]
[null,null,null,"THB - Thai Baht"]
[null,null,null,"TOP - Tongan Pa'anga"]
[null,null,null,"TWD - Taiwan New dollar"]
[null,null,null,"USD - United States dollar"]
[null,null,null,"VND - Vietnam Dong"]
[null,null,null,"VUV - Ni-Vanuata Vatu"]
[null,null,null,"WST - Samoan Tala"]